{"text_format":"1","workbook":"xlsx","n_sheets":10,"sheets":["User Control","Select ECPs","Contracted ECP List","Uncontracted ECP List","Geographic Analysis","Errors","Specialty Types","DataValidationFields","HPSA","County Names"],"not_rendered":{"charts":0,"images":5,"macros":1,"external_links":0,"defined_names":62,"comments":0,"pivot_tables":1},"unopened":[],"bounds":{"document_bytes":16777216,"sheet_cells":100000,"rows_first":2000,"rows_last":500,"rows_between":2000,"halvings":0,"cell_chars":16384,"cell_head_chars":4096},"cells_cut":0,"cells_raw":0,"read":"whole","date_system":"1900"}

{"sheet":"User Control","index":0,"n_rows":15,"n_cols":23,"rows_kept":15,"cut":false,"hidden":false,"merged":[[1,2,1,9],[2,2,2,9],[4,2,4,3],[4,6,4,9],[5,6,6,9],[9,6,12,9],[13,6,13,9],[14,6,19,9],[12,2,12,3],[7,6,8,9],[9,2,9,3],[10,2,10,4],[11,2,11,3],[13,2,13,4],[14,2,14,4]]}
["If macros are disabled, press and hold the ALT key and press the F, then I and then N key. After that, select the \"Enable All Content\" options by pressing enter."]
[null,null,"2026 MHBE Essential Community \nProviders Dental Template",null,null,null,null,null,null,null,null,null,"Current Tabs","Number of Rows per Tab","Number of Validation Errors","ECP Contracting Requirements Calculation:",null,{"$f":"SUM(N3:N3)","v":0}]
[null,null,"User Control & Details for Template",null,null,null,null,null,null,null,null,null,"Contracted ECP List",{"$f":"Ind_ECP_Row_Count","v":0},0,0,null,"Source Systems","Networks","Network Number","No. of Individual Tabs","Issuer's Selected State","Number of Selected Network IDs"]
[null,null,null,null,null,null,null,null,null,null,null,null,"Uncontracted ECP List",{"$f":"Uncontract_ECP_Count","v":0},0,null,null,"HIOS","AKN001",1,1,"MD","No"]
[null,null,"Issuer Information",null,null,null,"Notes & Instructions",null,null,null,null,null,null,null,null,null,null,"SERFF","AKN002",2]
[null,null,"Issuer ID:*",12345,null,null,"1. Enter all Issuer Information, then import network IDs from the CMS Network ID Template."]
[null,null,"Source System:*","SERFF"]
[null,null,"State:*","MD",null,null,"2. If you need to list uncontracted ECPs, select \"Yes\" from the dropdown next to \"Is this an Alternate ECP Calculation Issuer?\" (cell D9 of this tab)",null,null,null,null,null,"Validation Status"]
[null,null,"Is this an Alternate ECP Calculation Issuer?*","Yes",null,null,null,null,null,null,null,null,"Incomplete"]
[null,null,"Actions",null,null,null,"3. Data can be entered manually or Copy & Pasted into each tab. For Write-In ECPs that are not included on the \"Select ECPs\" tab, please indicate \"Write-In\" in the \"MHBE Number\" column! Ensure automatic calculation is turned on. Formulas → Calculation Options → Automatic\n\n4. ECPs are added to the \"Contracted ECP List\" by double-clicking the cell in the A column labelled \"Add ECP\" on the \"Select ECPs\" tab, then selecting \"Insert Selected ECPs\" in the top row of the \"Select ECPs\" tab.\n\n5. After inputting all contracted ECPs (or updating the \"Contracted ECP List\" tab) click the \"Refresh Pivot Table\" button on the \"Geographic Analysis\" tab.\n\n6. On the \"Contracted ECP List\" and \"Uncontracted ECP List\" tabs, all fields with an asterisk (*) are required. On the \"Contracted ECP List\" tab, 3 fields will need your input: \"Physician/Non-Physician\" (F), \"Specialty (Area of Medicine)\" (G), and \"Network IDs\" (Y).\n\n7. Validate data (using the \"Validate\" button below) after entering in all information "]
{"$rows_left_out":6}
{"sheet":"Select ECPs","index":1,"n_rows":70,"n_cols":40,"rows_kept":70,"cut":false,"hidden":false,"merged":[]}
["Action Keyboard Shortcut:\nShow All ECPs: CTRL + SHIFT + U\nClear All: CTRL + SHIFT + C\nShow Selected ECPs: CTRL + SHIFT + G\nInsert Selected ECPs: CTRL + SHIFT + M",null,null,null,null,null,null,null,null,null,null,null,null,null,null,null,null,null,null,null,null,null,null,null,null,null,null,null,null,null,null,null,null,null,null,null,null,null,null,{"$f":"MAX(COUNTA(A:A)-1,COUNTA(B:B),COUNTA(C:C),COUNTA(D:D),COUNTA(E:E),COUNTA(F:F),COUNTA(G:G),COUNTA(H:H),COUNTA(I:I),COUNTA(J:J),COUNTA(M:M),COUNTA(N:N),COUNTA(O:O),COUNTA(P:P),COUNTA(Q:Q),COUNTA(R:R))-1","v":68}]
["Add ECP?","MHBE Number","Site Name","Organization Name","National Provider Identifier","ECP Type: Hospital","ECP Type: FQHC","ECP Type: Ryan White","ECP Type: Family Planning","ECP Type: Indian Provider","ECP Type: Mental Health Facilities","ECP Type: Substance Use Disorder Treatment Centers","ECP Type: Other","ECP Type: 2016 Expansion Providers","MDH","Site Street Address 1","Site Street Address 2","Site City","Site State","Site Zip Code","Site County","Org Street Address 1","Org Street Address 2","Org City","Org State","Org Zip Code","Org County","POC 1 Name","POC 1 Title","POC 1 Phone #","POC 1 Phone Ext","POC 1 Email","URL 1","POC 2 Name","POC 2 Title","POC 2 Phone #","POC 2 Phone Ext","POC 2 Email","URL 2"]
[null,"MD_46886131_ECP","ANNE ARUNDEL COUNTY DEPARTMENT OF HEALTH","ANNE ARUNDEL CO. DEPT. OF HLTH","1932263795",0,0,0,0,0,0,0,0,1,1,"3 HARRY S. TRUMAN PKWY",null,"ANNAPOLIS","MD","21401-7085","ANNE ARUNDEL","3 HARRY S. TRUMAN PKWY",null,"ANNAPOLIS","MD","21401",null,"CECELIA THOMAS","OFFICE MANAGER, ACCOUNTS RECEIVABLE","410-222-7135"]
[null,"MD_87948973_ECP","BALTIMORE COUNTY DEPARTMENT OF HEALTH/DENTAL","BALTIMORE COUNTY DEPARTMENT OF HEALTH","1003042045",0,0,0,0,0,0,0,0,1,1,"9150 FRANKLIN SQUARE DR FL 3",null,"ROSEDALE","MD","21237-3903","BALTIMORE COUNTY","6401 YORK RD","3RD FLOOR","BALTIMORE","MD","21212-2152",null,"DAVID TAYLOR","HIPAA COMPLIANCE MANAGER","410-887-2702"]
[null,"MD_17990602_ECP","BALTIMORE MEDICAL SYSTEM","BALTIMORE MEDICAL SYSTEM","1346664562",0,1,0,0,0,0,0,0,0,0,"100 KANE STREET",null,"BALTIMORE","MD","21224","BALTIMORE CITY","5525 EASTERN AVE STE 301",null,"BALTIMORE","MD","21224-2796","BALTIMORE CITY","SHIRLEY SUTTON","PRESIDENT/CEO","410-558-4891",null,"Shirley.Sutton@bmsi.org","http://bmsi.org/our-programs/school-based-health-centers/",null,null,null,null,"Joe.Martin@bmsi.org"]
[null,"MD_60900928_ECP","BAY HUNDRED HEALTH CENTER AND DENTAL CENTER","CHOPTANK COMMUNITY HEALTH SYSTEM INC","1356388599",0,1,0,0,0,0,0,0,0,0,"301 RANDOLPH ST",null,"DENTON","MD","21629-1243","TALBOT","301 RANDOLPH ST",null,"DENTON","MD","21629-1243","CAROLINE","SARA RICH","CEO","410-479-4306",null,"jsheehan@choptankhealth.org",null,null,null,null,null,"smjohnson@choptankhealth.org"]
[null,"MD_44244608_ECP","BCHD ORAL HEALTH SERVICES","MAYOR AND CITY COUNCIL OF BALTIMORE","1679628846",0,0,0,0,0,0,0,0,1,1,"1515 W NORTH AVE",null,"BALTIMORE","MD","21217-1735","BALTIMORE CITY","1001 E FAYETTE ST",null,"BALTIMORE","MD","21202-4715",null,"TYRONE CHAPMAN","BILLING & REVENUE MGR.","443-739-3253"]
[null,"MD_89925442_ECP","BROOKLYN","FAMILY HEALTH CENTERS OF BALTIMORE, INC.","1336326248",0,1,0,0,0,0,0,0,0,0,"3540 S HANOVER ST",null,"BROOKLYN","MD","21225-1732","BALTIMORE CITY","631 CHERRY HILL RD",null,"BALTIMORE","MD","21225-1228","BALTIMORE CITY","PAULA MCLELLAN","CEO","410-354-2001",null,"pmclellan@fhcb.org",null,null,null,null,"11222","wmccray@fhcb.org"]
[null,"MD_70794553_ECP","CARROLL HOSPITAL","CARROLL HEALTH GROUP, LLC","1528403995",1,0,0,0,0,1,0,0,0,0,"200 MEMORIAL AVE",null,"WESTMINSTER","MD","21157-5726","CARROLL","200 MEMORIAL AVE",null,"WESTMINSTER","MD","21157-5726",null,"MICHAEL MYERS","VP","410-871-6114",null,null,"http://www.carrollhospitalcenter.org/behavioral-health"]
[null,"MD_13629719_ECP","CHASE BREXTON HEALTH CARE AT COLUMBIA","CHASE BREXTON HEALTH SERVICES, INC.","1376589309",0,1,1,0,0,1,0,0,0,0,"5500 KNOLL NORTH DR","STE 370","COLUMBIA","MD","21045-2209","HOWARD","1111 NORTH CHARLES STREET",null,"BALTIMORE","MD","21201","BALTIMORE CITY","KYLE EASTON","REVENUE CYCLE DIRECTOR","410-837-2050",null,"jshahan@chasebrexton.org"]
{"$rows_left_out":61}
{"sheet":"Contracted ECP List","index":2,"n_rows":2,"n_cols":26,"rows_kept":2,"cut":false,"hidden":false,"merged":[]}
["Action Keyboard Shortcut:\nSelect All: CTRL + SHIFT + A\nClear All: CTRL + SHIFT + C\nRemove Selected ECPs and Blank Rows: CTRL + SHIFT + R",null,null,null,null,null,null,null,null,null,null,null,null,null,null,null,null,null,null,null,null,null,null,null,null,{"$f":"MAX(COUNTA(A:A)-1,COUNTA(B:B),COUNTA(C:C),COUNTA(G:G),COUNTA(I:I),COUNTA(J:J),COUNTA(K:K),COUNTA(L:L),COUNTA(M:M),COUNTA(P:P),COUNTA(Q:Q),COUNTA(R:R),COUNTA(S:S),COUNTA(T:T),COUNTA(U:U),COUNTA(V:V),COUNTA(W:W))-1","v":0}]
["REMOVE","MHBE Number","National Provider Identifier (NPI)*","Name of Provider*","Suffix of Provider","Physician/Non Physician*","Specialty Type (area of medicine)*","Provider Entity Name*","ECP Type: Hospital","ECP Type: FQHC","ECP Type: Ryan White","ECP Type: Family Planning","ECP Type: Indian Provider","ECP Type: Mental Health Facilities","ECP Type: Substance Use Disorder Treatment Centers","ECP Type: Other","ECP Type: 2016 Expansion Providers","MDH List","Street Address*","Street Address 2","City*"," State*","County*","Zip*","Network IDs*"]

{"sheet":"Uncontracted ECP List","index":3,"n_rows":1430,"n_cols":7,"rows_kept":1430,"cut":false,"hidden":false,"merged":[[0,4,0,5]]}
["If you selected \"Yes\" to the question \"Are you an Alternate ECP Standard Issuer?\",  please use this tab to list the ECPs that you were unable to contract with by their MHBE number, NPI, Provider Name, and how the ECP does not meet the credentialing standards. Select the MHBE Number from the dropdown list and the NPI and Provider Name will autopopulate to their columns. If you need to remove an ECP, double-click in the \"Remove ECP?\" column and click the \"Remove Selected ECPs\" button. Click the \"Clear All\" button or double-click again to undo \"Remove ECP?\" selection.",null,null,null,"Uncontracted ECP List",null,{"$f":"MAX(COUNTA(B:B))-1","v":0}]
["Remove ECP?","MHBE Number*","National Provider Identification (NPI)*","County","Provider Name*","Reason unable to contract*","Additional Information"]
[null,null,{"$f":"IFERROR((VLOOKUP(B3,'Select ECPs'!$B$2:$E$77,4,0)),\"\")","v":""},{"$f":"IFERROR((VLOOKUP(B3,'Select ECPs'!$B$2:$U$77,20,0)),\"\")","v":""},{"$f":"IFERROR((VLOOKUP(B3,'Select ECPs'!$B$2:$E$77,2,0)),\"\")","v":""}]
[null,null,{"$f":"IFERROR((VLOOKUP(B4,'Select ECPs'!$B$2:$E$77,4,0)),\"\")","v":""},{"$f":"IFERROR((VLOOKUP(B4,'Select ECPs'!$B$2:$U$77,20,0)),\"\")","v":""},{"$f":"IFERROR((VLOOKUP(B4,'Select ECPs'!$B$2:$E$77,2,0)),\"\")","v":""}]
[null,null,{"$f":"IFERROR((VLOOKUP(B5,'Select ECPs'!$B$2:$E$77,4,0)),\"\")","v":""},{"$f":"IFERROR((VLOOKUP(B5,'Select ECPs'!$B$2:$U$77,20,0)),\"\")","v":""},{"$f":"IFERROR((VLOOKUP(B5,'Select ECPs'!$B$2:$E$77,2,0)),\"\")","v":""}]
[null,null,{"$f":"IFERROR((VLOOKUP(B6,'Select ECPs'!$B$2:$E$77,4,0)),\"\")","v":""},{"$f":"IFERROR((VLOOKUP(B6,'Select ECPs'!$B$2:$U$77,20,0)),\"\")","v":""},{"$f":"IFERROR((VLOOKUP(B6,'Select ECPs'!$B$2:$E$77,2,0)),\"\")","v":""}]
[null,null,{"$f":"IFERROR((VLOOKUP(B7,'Select ECPs'!$B$2:$E$77,4,0)),\"\")","v":""},{"$f":"IFERROR((VLOOKUP(B7,'Select ECPs'!$B$2:$U$77,20,0)),\"\")","v":""},{"$f":"IFERROR((VLOOKUP(B7,'Select ECPs'!$B$2:$E$77,2,0)),\"\")","v":""}]
[null,null,{"$f":"IFERROR((VLOOKUP(B8,'Select ECPs'!$B$2:$E$77,4,0)),\"\")","v":""},{"$f":"IFERROR((VLOOKUP(B8,'Select ECPs'!$B$2:$U$77,20,0)),\"\")","v":""},{"$f":"IFERROR((VLOOKUP(B8,'Select ECPs'!$B$2:$E$77,2,0)),\"\")","v":""}]
[null,null,{"$f":"IFERROR((VLOOKUP(B9,'Select ECPs'!$B$2:$E$77,4,0)),\"\")","v":""},{"$f":"IFERROR((VLOOKUP(B9,'Select ECPs'!$B$2:$U$77,20,0)),\"\")","v":""},{"$f":"IFERROR((VLOOKUP(B9,'Select ECPs'!$B$2:$E$77,2,0)),\"\")","v":""}]
[null,null,{"$f":"IFERROR((VLOOKUP(B10,'Select ECPs'!$B$2:$E$77,4,0)),\"\")","v":""},{"$f":"IFERROR((VLOOKUP(B10,'Select ECPs'!$B$2:$U$77,20,0)),\"\")","v":""},{"$f":"IFERROR((VLOOKUP(B10,'Select ECPs'!$B$2:$E$77,2,0)),\"\")","v":""}]
{"$rows_left_out":1421}
{"sheet":"Geographic Analysis","index":4,"n_rows":31,"n_cols":5,"rows_kept":31,"cut":false,"hidden":false,"merged":[]}
["Select the \"Refresh Pivot Table\" when \"Contracted ECP List\" tab has been updated."]
[]
[null,null,null,"Count of ECPs by County"]
[null,null,null,null,"Grand Total"]
["County Name","Contracted ECPs",null,"Grand Total"]
["Allegany",{"$f":"COUNTIF('Contracted ECP List'!$W$950, 'Geographic Analysis'!A6)","v":0}]
["Anne Arundel",{"$f":"COUNTIF('Contracted ECP List'!$W$950, 'Geographic Analysis'!A7)","v":0}]
["Baltimore City",{"$f":"COUNTIF('Contracted ECP List'!$W$950, 'Geographic Analysis'!A8)","v":0}]
["Baltimore",{"$f":"COUNTIF('Contracted ECP List'!$W$950, 'Geographic Analysis'!A9)","v":0}]
["Calvert",{"$f":"COUNTIF('Contracted ECP List'!$W$950, 'Geographic Analysis'!A10)","v":0}]
{"$rows_left_out":22}
{"sheet":"Errors","index":5,"n_rows":2,"n_cols":3,"rows_kept":2,"cut":false,"hidden":false,"merged":[[0,0,0,2]]}
["Below are the validation errors that were identified in the submitted data. Please correct these errors. You must have a valid template before you can export data to XML files. Select the Cell address that is underlined and highlighted in blue to navigate to the specified error. \n\nImportant Note: If one or more rows are deleted in a provider tab or data is reorganized, cell hyperlinks in that tab may no longer be accurate. Please re-run the data validation on the 'User Control' tab to refresh the hyperlinks if this occurs."]
["Tab","Cell","Validation Error Message"]

{"sheet":"Specialty Types","index":6,"n_rows":44,"n_cols":4,"rows_kept":44,"cut":false,"hidden":false,"merged":[[2,2,2,3],[1,1,1,4]]}
["The instructions for populating the Specialty/Facility Types can be found from cell C3.\nIndividual Provider (MD/DO) Specialty Types table can be found in cells C5 through C44.\nFacility, Pharmacy, and Other Non-MD/DO Specialty Types can be found in cells D5 through D44."]
[null,"Instructions for populating the Specialty/Facility Types without using the drop-down menu"]
[null,null,"The lists below show the specialty/facility & pharmacy types that can be entered in the ECP template. Column C shows the Individual Provider (MD/DO) Specialty Types. Column D shows the Facility, Pharmacy, and Other Non-MD/DO Specialty Types.  Both sets of Specialty Types are allowed to be entered for a provider.  If you would like to enter more than 1 specialty/facility type for a record, please comma separate each type. For example, if you would like to assign 001 General Practice and 002 Family Medicine specialty types to a provider, please enter the types as \"001 General Practice, 002 Family Medicine\". Entering multiple specialty/facility types using any other convention will result in a validation error. The same comma separation technique can be used to assign multiple Network IDs to the same provider. For example, an issuer in Maryland with 3 Netowrk IDs could assign network 1 and network 3 to the same provider by entering \"MDN001, MDN003\"."]
[null,null,"Individual Provider (MD/DO) Specialty Types","Facility, Pharmacy, and Other Non-MD/DO Specialty Types"]
[null,null,"001 General Practice","Pharmacy"]
[null,null,"002 Family Medicine","040 General Acute Care Hospital"]
[null,null,"003 Internal Medicine","041 Cardiac Surgery Program"]
[null,null,"004 Geriatrics","042 Cardiac Catheterization Services"]
[null,null,"005 Primary Care - Physician Assistant","043 Critical Care Services - Intensive Care Units (ICU)"]
[null,null,"006 Primary Care - Nurse Practitioner","044 Outpatient Dialysis"]
{"$rows_left_out":35}
{"sheet":"DataValidationFields","index":7,"n_rows":289,"n_cols":23,"rows_kept":289,"cut":false,"hidden":true,"merged":[]}
["Physician/ Non-Physician","Codes associated with column C in this tab","Facility/Specialty Types for ECPs Tabs","Codes associated with column E in this tab","Facility/Specialty Types for NA Tabs","States List","Contiguous State List","County Drop-Down List","State","County","StateCountyCheck","StCtyCode","FIPScode","SelectEcpCol","IndividualEcpCol","Provider","Codes associated with column S in this tab","ECP Categories","Networks","MHBE Numbers","ECP Names","NPIs","Uncontracted ECP List Reasons"]
["Physician, Non-Physician",1,"Black Lung Clinics",1,"001 General Practice","DC","DC, MD, VA","District of Columbia","DC","District of Columbia","DCDISTRICT OF COLUMBIA",null,11001,3,4,"Primary Care",19,"Black Lung Clinics","MDN001","MD_46886131_ECP","ANNE ARUNDEL COUNTY DEPARTMENT OF HEALTH","1932263795","Provider moved/retired or facility closed (provide contact information if it differs from MHBE's ECP List)."]
["Physician",2,"Community Mental Health Centers",2,"002 Family Medicine","DE","DE, MD, NJ, PA","Kent, New Castle, Sussex","DC","Out of State","DCOUT OF STATE",null,"11111",4,8,"Specialty Care",9,"Community Mental Health Centers","MDN002","MD_87948973_ECP","BALTIMORE COUNTY DEPARTMENT OF HEALTH/DENTAL","1003042045","Good faith contract offer(s) for upcoming plan year rejected by provider (please detail efforts in next column)."]
["Non-Physician",3,"Dental Providers",3,"003 Internal Medicine","MD","MD, DC, DE, PA, VA, WV","Allegany, Anne Arundel, Baltimore, Baltimore City, Calvert, Caroline, Carroll, Cecil, Charles, Dorchester, Frederick, Garrett, Harford, Howard, Kent, Montgomery, Prince Georges, Queen Annes, St Marys, Somerset, Talbot, Washington, Wicomico, Worcester","DE","Kent","DEKENT",null,10001,5,3,"Pharmacy",6,"Dental Providers","MDN003","MD_17990602_ECP","BALTIMORE MEDICAL SYSTEM","1346664562","Provider contracts exclusively with another carrier/organization (please list the carrier in the next column)."]
[null,4,"Family Planning Providers",4,"004 Geriatrics","PA","PA, DE, MD, NJ, NY, OH, WV","Adams, Allegheny, Armstrong, Beaver, Bedford, Berks, Blair, Bradford, Bucks, Butler, Cambria, Cameron, Carbon, Centre, Chester, Clarion, Clearfield, Clinton, Columbia, Crawford, Cumberland, Dauphin, Delaware, Elk, Erie, Fayette, Forest, Franklin, Fulton, Greene, Huntingdon, Indiana, Jefferson, Juniata, Lackawanna, Lancaster, Lawrence, Lebanon, Lehigh, Luzerne, Lycoming, McKean, Mercer, Mifflin, Monroe, Montgomery, Montour, Northampton, Northumberland, Perry, Philadelphia, Pike, Potter, Schuylkill, Snyder, Somerset, Sullivan, Susquehanna, Tioga, Union, Venango, Warren, Washington, Wayne, Westmoreland, Wyoming, York","DE","New Castle","DENEW CASTLE",null,10003,6,9,"Hospital",21,"Family Planning Providers","MDN004","MD_60900928_ECP","BAY HUNDRED HEALTH CENTER AND DENTAL CENTER","1356388599","Provider does not contract with your organization's plan type (provide contact information for MHBE to follow-up)."]
[null,5,"Federally Qualified Health Centers",5,"005 Primary Care - Physician Assistant","VA","VA, DC, KY, MD, NC, TN, WV","Accomack, Albemarle, Alexandria City, Alleghany, Amelia, Amherst, Appomattox, Arlington, Augusta, Bath, Bedford, Bland, Botetourt, Bristol City, Brunswick, Buchanan, Buckingham, Buena Vista City, Campbell, Caroline, Carroll, Charles City, Charlotte, Charlottesville City, Chesapeake City, Chesterfield, Clarke, Colonial Heights City, Covington City, Craig, Culpeper, Cumberland, Danville City, Dickenson, Dinwiddie, Emporia City, Essex, Fairfax, Fairfax City, Falls Church City, Fauquier, Floyd, Fluvanna, Franklin, Franklin City, Frederick, Fredericksburg City, Galax City, Giles, Gloucester, Goochland, Grayson, Greene, Greensville, Halifax, Hampton City, Hanover, Harrisonburg City, Henrico, Henry, Highland, Hopewell City, Isle of Wight, James City, King and Queen, King George, King William, Lancaster, Lee, Lexington City, Loudoun, Louisa, Lunenburg, Lynchburg City, Madison, Manassas City, Manassas Park City, Martinsville City, Mathews, Mecklenburg, Middlesex, Montgomery, Nelson, New Kent, Newport News City, Norfolk City, Northampton, Northumberland, Norton City, Nottoway, Orange, Page, Patrick, Petersburg City, Pittsylvania, Poquoson City, Portsmouth City, Powhatan, Prince Edward, Prince George, Prince William, Pulaski, Radford, Rappahannock, Richmond, Richmond City, Roanoke, Roanoke City, Rockbridge, Rockingham, Russell, Salem, Scott, Shenandoah, Smyth, Southampton, Spotsylvania, Stafford, Staunton City, Suffolk City, Surry, Sussex, Tazewell, Virginia Beach City, Warren, Washington, Waynesboro City, Westmoreland, Williamsburg City, Winchester City, Wise, Wythe, York","DE","Sussex","DESUSSEX",null,10005,7,10,"Ancillary Services",23,"Federally Qualified Health Centers",null,"MD_44244608_ECP","BCHD ORAL HEALTH SERVICES","1679628846"]
[null,6,"Freestanding Cancer Centers",6,"006 Primary Care - Nurse Practitioner","WV","WV, KY, MD, OH, PA, VA","Barbour, Berkeley, Boone, Braxton, Brooke, Cabell, Calhoun, Clay, Doddridge, Fayette, Gilmer, Grant, Greenbrier, Hampshire, Hancock, Hardy, Harrison, Jackson, Jefferson, Kanawha, Lewis, Lincoln, Logan, Marion, Marshall, Mason, McDowell, Mercer, Mineral, Mingo, Monongalia, Monroe, Morgan, Nicholas, Ohio, Pendleton, Pleasants, Pocahontas, Preston, Putnam, Raleigh, Randolph, Ritchie, Roane, Summers, Taylor, Tucker, Tyler, Upshur, Wayne, Webster, Wetzel, Wirt, Wood, Wyoming","DE","Out of State","DEOUT OF STATE",null,24001,8,11,"NA",11,"Freestanding Cancer Centers",null,"MD_89925442_ECP","BROOKLYN","1336326248"]
[null,7,"Hemophilia Treatment Centers",7,"007 Allergy and Immunology",null,null,null,"MD","Allegany","MDALLEGANY",null,"11111",9,12,null,12,"Hemophilia Treatment Centers",null,"MD_70794553_ECP","CARROLL HOSPITAL","1528403995"]
[null,8,"Children's Hospitals (inpatient only)",8,"008 Cardiovascular Disease",null,null,null,"MD","Anne Arundel","MDANNE ARUNDEL",null,24003,10,13,null,26,"Children's Hospitals (inpatient only)",null,"MD_13629719_ECP","CHASE BREXTON HEALTH CARE AT COLUMBIA","1376589309"]
[null,9,"Inpatient Hospitals (other than children's hospitals)",10,"010 Chiropracty",null,null,null,"MD","Baltimore","MDBALTIMORE",null,24005,11,14,null,27,"Inpatient Hospitals (other than children's hospitals)",null,"MD_80120920_ECP","CHASE BREXTON HEALTH CARE AT MOUNT VERNON","1588606305"]
{"$rows_left_out":280}
{"sheet":"HPSA","index":8,"n_rows":195,"n_cols":3,"rows_kept":195,"cut":false,"hidden":false,"merged":[]}
["Zip Code table can be found in cells B2 through B26932.\nState table can be found in cells C2 through C26932.","Zip Code","State"]
[null,"20233","MD"]
[null,"20389","MD"]
[null,"20395","MD"]
[null,"20409","MD"]
[null,"20599","MD"]
[null,"20608","MD"]
[null,"20611","MD"]
[null,"20612","MD"]
[null,"20625","MD"]
{"$rows_left_out":186}
{"sheet":"County Names","index":9,"n_rows":29,"n_cols":5,"rows_kept":29,"cut":false,"hidden":false,"merged":[[1,2,1,4],[2,2,2,4]]}
["The instructions for using County Names used in the ECP/Network Adequacy Template can be found from cell C3.\nState table can be found in cells C5 through C3145.\nCounty Name table can be found in cells D5 through D3145.\nFips Code table can be found in cells E5 through E3145."]
[null,null,"County Names used in the ECP Template"]
[null,null,"The list below shows the county names that are used and accepted in the ECP template. If you aren't using the drop-down menus, please ensure that your county names match the names below. A different version of a county name will result in a validation error. The county names below are the same as those in the Service Area template. Only include the county name in the county field, do not include the FIPS code."]
[null,null,"State","County Name","FIPS Code"]
[null,null,"MD","Allegany",24001]
[null,null,"MD","Anne Arundel",24003]
[null,null,"MD","Baltimore County",24005]
[null,null,"MD","Baltimore City",24510]
[null,null,"MD","Calvert",24009]
[null,null,"MD","Caroline",24011]
{"$rows_left_out":19}